Target
PC4 and SFRS1-interacting protein
Ligand
BDBM33090
Substrate
Meas. Tech.
Counterscreen for inhibitors of LEDGF/p75-dependent integration: TR-FRET-based biochemical high throughput dose response counterscreen assay to identify activators of HIV-1 Integrase multimerization
IC50
13895±n/a nM
Citation
 PubChem, PC Counterscreen for inhibitors of LEDGF/p75-dependent integration: TR-FRET-based biochemical high throughput dose response counterscreen assay to identify activators of HIV-1 Integrase multimerization PubChem Bioassay (2014)[AID] 
Target
Name:
PC4 and SFRS1-interacting protein
Synonyms:
DFS70 LEDGF/p75 PSIP1_HUMAN lens epithelium-derived growth factor p75
Type:
Enzyme Catalytic Domain
Mol. Mass.:
60120.68
Organism:
Homo sapiens (Human)
Description:
gi_6708281
Residue:
530
  
Inhibitor
Name:
BDBM33090
Synonyms:
(4E)-4-[[(2-ethylimino-4-methyl-1,3-thiazol-3-yl)amino]methylidene]-2,3-bis(oxidanyl)cyclohexa-2,5-dien-1-one (4E)-4-[[(2-ethylimino-4-methyl-3-thiazolyl)amino]methylidene]-2,3-dihydroxy-1-cyclohexa-2,5-dienone (4Z)-4-[[(2-ethylimino-4-methyl-4-thiazolin-3-yl)amino]methylene]-2,3-dihydroxy-cyclohexa-2,5-dien-1-one SMR000151702 | cid_5825518
Type:
Small organic molecule
Emp. Form.:
C13H15N3O3S
Mol. Mass.:
293.342
SMILES:
CCN=c1scc(C)n1N=Cc1ccc(O)c(O)c1O
: