Target
PC4 and SFRS1-interacting protein
Ligand
BDBM115149
Substrate
Meas. Tech.
Counterscreen for inhibitors of LEDGF/p75-dependent integration: TR-FRET-based biochemical high throughput dose response counterscreen assay to identify activators of HIV-1 Integrase multimerization
IC50
4634±n/a nM
Citation
 PubChem, PC Counterscreen for inhibitors of LEDGF/p75-dependent integration: TR-FRET-based biochemical high throughput dose response counterscreen assay to identify activators of HIV-1 Integrase multimerization PubChem Bioassay (2014)[AID] 
Target
Name:
PC4 and SFRS1-interacting protein
Synonyms:
DFS70 LEDGF/p75 PSIP1_HUMAN lens epithelium-derived growth factor p75
Type:
Enzyme Catalytic Domain
Mol. Mass.:
60120.68
Organism:
Homo sapiens (Human)
Description:
gi_6708281
Residue:
530
  
Inhibitor
Name:
BDBM115149
Synonyms:
2-Naphthalenesulfonic acid, 6-(dimethylamino)-4-hydroxy- 6-(dimethylamino)-4-hydroxy-naphthalene-2-sulfonic acid 6-(dimethylamino)-4-oxidanyl-naphthalene-2-sulfonic acid SMR001547551 | cid_80417
Type:
Small organic molecule
Emp. Form.:
C12H13NO4S
Mol. Mass.:
267.301
SMILES:
CN(C)c1ccc2cc(cc(O)c2c1)S(O)(=O)=O
: