Target
PC4 and SFRS1-interacting protein
Ligand
BDBM50785
Substrate
Meas. Tech.
TR-FRET-based biochemical high throughput dose response assay to identify inhibitors of HIV-1 LEDGF/p75 DNA Integration
IC50
2411±n/a nM
Citation
 PubChem, PC TR-FRET-based biochemical high throughput dose response assay to identify inhibitors of HIV-1 LEDGF/p75 DNA Integration PubChem Bioassay (2014)[AID] 
Target
Name:
PC4 and SFRS1-interacting protein
Synonyms:
DFS70 LEDGF/p75 PSIP1_HUMAN lens epithelium-derived growth factor p75
Type:
Enzyme Catalytic Domain
Mol. Mass.:
60120.68
Organism:
Homo sapiens (Human)
Description:
gi_6708281
Residue:
530
  
Inhibitor
Name:
BDBM50785
Synonyms:
1-[3-[1-cyano-2-oxo-2-[(phenylmethyl)amino]ethyl]-2-quinoxalinyl]-3-piperidinecarboxylic acid ethyl ester MLS000079951 cid_660313 ethyl 1-[3-[2-(benzylamino)-1-cyano-2-oxoethyl]quinoxalin-2-yl]piperidine-3-carboxylate
Type:
Small organic molecule
Emp. Form.:
C26H27N5O3
Mol. Mass.:
457.5243
SMILES:
CCOC(=O)C1CCCN(C1)c1nc2ccccc2nc1C(C#N)C(=O)NCc1ccccc1
: