Target
Beta-secretase 2
Ligand
BDBM116233
Substrate
Meas. Tech.
Inhibition Assay
pH
4.5±n/a
Temperature
298.15±n/a K
IC50
20±n/a nM
Comments
extracted
Citation
 Badiger, SChebrolu, MHurth, KJacquier, SLueoend, RMMachauer, RRueeger, HTintelnot-Blomley, MVeenstra, SJVoegtle, M Heterocyclic derivatives and their use in the treatment of neurological disorders US Patent  US8637508 Publication Date 1/28/2014 
Target
Name:
Beta-secretase 2
Synonyms:
AEPLC ASP1 Asp 1 Aspartyl protease 1 BACE2_HUMAN Beta-secretase (BACE) Beta-secretase 2 (BACE-2) Beta-site APP-cleaving enzyme 2 Memapsin-1 beta-Secretase (BACE-2)
Type:
Protein
Mol. Mass.:
56171.20
Organism:
Homo sapiens (Human)
Description:
Q9Y5Z0
Residue:
518
  
Inhibitor
Name:
BDBM116233
Synonyms:
US10035794, Example 8 US8637508, 8
Type:
Small organic molecule
Emp. Form.:
C20H19F3N6O2
Mol. Mass.:
432.3991
SMILES:
Cc1cc(cnc1C(=O)Nc1cccc(n1)[C@]1(C)CO[C@](C)(C(N)=N1)C(F)(F)F)C#N
: