Target
Aurora kinase A
Ligand
BDBM116508
Substrate
Meas. Tech.
Enzyme Assay
IC50
0.44±n/a nM
Citation
 Sutton, AELan, RRichardson, TEPerrey, DVandeveer, HGHuck, BRKarra, SRChen, XXiao, YLiu-Bujalski, LGoutopoulos, AStieber, FHodous, BLQiu, HJones, RHeasley, BH Amino azaheterocyclic carboxamides US Patent  US8637532 Publication Date 1/28/2014 
Target
Name:
Aurora kinase A
Synonyms:
AIK ARK-1 AURA AURKA_HUMAN Aurora 2 Aurora kinase A (AURKA) Aurora kinase A (Aurora-2) Aurora/IPL1-related kinase 1 Breast tumor-amplified kinase IAK1 STK15 GN Serine/threonine kinase 15 Serine/threonine-protein kinase 6 Serine/threonine-protein kinase aurora-A aurora-2 | hARK1
Type:
Serine/threonine-protein kinase
Mol. Mass.:
45830.98
Organism:
Homo sapiens (Human)
Description:
O14965
Residue:
403
  
Inhibitor
Name:
BDBM116508
Synonyms:
US8637532, 189
Type:
Small organic molecule
Emp. Form.:
C25H22F2N6O2
Mol. Mass.:
476.478
SMILES:
CNCC(Nc1ncnc2c(cccc12)C(N)=O)c1cccc(NC(=O)c2ccc(F)c(F)c2)c1
: