Target
N-lysine methyltransferase SMYD2
Ligand
BDBM283203
Substrate
Meas. Tech.
Scintillation Proximity Assay (SPA) for Detection of SMYD2 Enzymatic Inhibition
pH
9±n/a
IC50
157±n/a nM
Comments
extracted
Citation
 Mowat, JSStellfeld, TStresemann, CHillig, RKöhr, SStöckigt, DWeiske, JBrumby, TBarak, NChrist, CTer Laak, ABadock, VCrampton, RHStefanuti, I Aryl-cyanoguanidine compounds US Patent  US10023539 Publication Date 7/17/2018 
Target
Name:
N-lysine methyltransferase SMYD2
Synonyms:
HSKM-B KMT3C N-lysine methyltransferase SMYD2 SET and MYND domain-containing protein 2 (SMYD2) SMYD2_HUMAN
Type:
Enzyme
Mol. Mass.:
49689.57
Organism:
Homo sapiens (Human)
Description:
Q9NRG4
Residue:
433
  
Inhibitor
Name:
BDBM283203
Synonyms:
Rac-N-[3-(4-chloro-3-fluorophenyl)-1-{N′-cyano-N-[3-(trifluoromethoxy)phenyl]-carbamimidoyl}-4,5-dihydro-1H-pyrazol-4-yl]-N-ethyl-2-hydroxyacetamide | US10023539, Example 35
Type:
Small organic molecule
Emp. Form.:
C22H19ClF4N6O3
Mol. Mass.:
526.871
SMILES:
CCN(C1CN(N=C1c1ccc(Cl)c(F)c1)C(\Nc1cccc(OC(F)(F)F)c1)=N/C#N)C(=O)CO
: