Target
Prokineticin receptor 1
Ligand
BDBM121300
Substrate
Meas. Tech.
Calcium Mobilization Assay
Temperature
310.15±n/a K
Ki
4.72±n/a nM
Comments
extracted
Citation
 Zhou, QLi, JHuang, Q Prokineticin receptor antagonists and uses thereof US Patent  US8722896 Publication Date 5/13/2014 
Target
Name:
Prokineticin receptor 1
Synonyms:
Prokineticin receptor 1 (PRK1)
Type:
Enzyme
Mol. Mass.:
44908.29
Organism:
Cricetulus griseus (Chinese hamster)
Description:
G3HIE5
Residue:
399
  
Inhibitor
Name:
BDBM121300
Synonyms:
US8722896, (-)-(3R)-1-(N-methyl-indol-4- ylmethyl)-N-(9-chloro-2,3,4,5- tetrahydro-1-benzoxepin-7- ylmethyl)-N-isobutylpiperidine- 3-carboxamide
Type:
Small organic molecule
Emp. Form.:
C31H40ClN3O2
Mol. Mass.:
522.121
SMILES:
CC(C)CN(Cc1cc(Cl)c2OCCCCc2c1)C(=O)C1CCCN(Cc2cccc3n(C)ccc23)C1
: