Target
Vascular endothelial growth factor receptor 1
Ligand
BDBM4659
Substrate
poly(E,A,Y)
Meas. Tech.
VEGF-R Kinase Inhibition Assay
pH
7.4±n/a
Temperature
295.15±n/a K
IC50
300±n/a nM
Citation
 Hennequin, LFStokes, ESThomas, APJohnstone, CPle, PAOgilvie, DJDukes, MWedge, SRKendrew, JCurwen, JO Novel 4-anilinoquinazolines with C-7 basic side chains: design and structure activity relationship of a series of potent, orally active, VEGF receptor tyrosine kinase inhibitors. J Med Chem 45:1300-12 (2002)  
Target
Name:
Vascular endothelial growth factor receptor 1
Synonyms:
FLT FRT Fms-like tyrosine kinase 1 Tyrosine-protein kinase FRT VEGFR-1 VGFR1_HUMAN Vascular endothelial growth factor receptor 1 (FLT1) Vascular endothelial growth factor receptor 1 and 2 (Flt-1 and KDR) Vascular permeability factor receptor vascular endothelial growth factor/vascular permeability factor receptor
Type:
Receptor Tyrosine Kinase
Mol. Mass.:
150800.23
Organism:
Homo sapiens (Human)
Description:
P17948
Residue:
1338
  
Inhibitor
Name:
BDBM4659
Synonyms:
4-Anilinoquinazoline 6 | N-(4-Chloro-2-fluorophenyl)-6-methoxy-7-[2-(4-methylpiperazin-1-yl)ethoxy]quinazolin-4-amine
Type:
Small organic molecule
Emp. Form.:
C22H25ClFN5O2
Mol. Mass.:
445.918
SMILES:
COc1cc2c(Nc3ccc(Cl)cc3F)ncnc2cc1OCCN1CCN(C)CC1
:
Substrate
Name:
poly(E,A,Y)
Synonyms:
Type:
Random Copolymer
Mol. Mass.:
358.43
Organism:
Description:
A poly(glu, ala, tyr) 6:3:1 random copolymer. 2 uM ATP was used as co-substrate.
Residue:
3
NA