Target
Tyrosine-protein kinase BTK
Ligand
BDBM122398
Substrate
Meas. Tech.
Inhibition Assay
pH
7.2±n/a
IC50
27.02±n/a nM
Comments
extracted
Citation
 Billedeau, RJKondru, RKLopez-Tapia, FJLou, YOwens, TDQian, YSo, SThakkar, KCWanner, JMorales, OJ Inhibitors of bruton's tyrosine kinase US Patent  US8729078 Publication Date 5/20/2014 
Target
Name:
Tyrosine-protein kinase BTK
Synonyms:
AGMX1 Agammaglobulinaemia tyrosine kinase B cell progenitor kinase BPK BTK_HUMAN Tyrosine Kinase BTK Tyrosine-protein kinase BTK (BTK)
Type:
Enzyme
Mol. Mass.:
76289.95
Organism:
Homo sapiens (Human)
Description:
Q06187
Residue:
659
  
Inhibitor
Name:
BDBM122398
Synonyms:
US8729078, I-3
Type:
Small organic molecule
Emp. Form.:
C24H24N4O3
Mol. Mass.:
416.4724
SMILES:
CC(C)(C)c1ccc2c(cnn(-c3cccc(-c4c[nH]c(c4)C(N)=O)c3CO)c2=O)c1
: