Target
Tyrosine-protein kinase BTK
Ligand
BDBM122402
Substrate
Meas. Tech.
Inhibition Assay
pH
7.2±n/a
IC50
18.23±n/a nM
Comments
extracted
Citation
 Billedeau, RJKondru, RKLopez-Tapia, FJLou, YOwens, TDQian, YSo, SThakkar, KCWanner, JMorales, OJ Inhibitors of bruton's tyrosine kinase US Patent  US8729078 Publication Date 5/20/2014 
Target
Name:
Tyrosine-protein kinase BTK
Synonyms:
AGMX1 Agammaglobulinaemia tyrosine kinase B cell progenitor kinase BPK BTK_HUMAN Tyrosine Kinase BTK Tyrosine-protein kinase BTK (BTK)
Type:
Enzyme
Mol. Mass.:
76289.95
Organism:
Homo sapiens (Human)
Description:
Q06187
Residue:
659
  
Inhibitor
Name:
BDBM122402
Synonyms:
US8729078, I-8
Type:
Small organic molecule
Emp. Form.:
C24H24FN5O3
Mol. Mass.:
449.4775
SMILES:
Cn1cc(nc1C(N)=O)-c1cccc(c1CO)-n1ncc2cc(cc(F)c2c1=O)C(C)(C)C
: