Target
Tyrosine-protein kinase BTK
Ligand
BDBM122407
Substrate
Meas. Tech.
Inhibition Assay
pH
7.2±n/a
IC50
39.35±n/a nM
Comments
extracted
Citation
 Billedeau, RJKondru, RKLopez-Tapia, FJLou, YOwens, TDQian, YSo, SThakkar, KCWanner, JMorales, OJ Inhibitors of bruton's tyrosine kinase US Patent  US8729078 Publication Date 5/20/2014 
Target
Name:
Tyrosine-protein kinase BTK
Synonyms:
AGMX1 Agammaglobulinaemia tyrosine kinase B cell progenitor kinase BPK BTK_HUMAN Tyrosine Kinase BTK Tyrosine-protein kinase BTK (BTK)
Type:
Enzyme
Mol. Mass.:
76289.95
Organism:
Homo sapiens (Human)
Description:
Q06187
Residue:
659
  
Inhibitor
Name:
BDBM122407
Synonyms:
US8729078, I-13
Type:
Small organic molecule
Emp. Form.:
C25H22FN3O3
Mol. Mass.:
431.4589
SMILES:
Cn1cc(cc1C(N)=O)-c1cccc(c1CO)-n1ccc2cc(cc(F)c2c1=O)C1CC1
: