Target
Tyrosine-protein kinase BTK
Ligand
BDBM122409
Substrate
Meas. Tech.
Inhibition Assay
pH
7.2±n/a
IC50
3.2±n/a nM
Comments
extracted
Citation
 Billedeau, RJKondru, RKLopez-Tapia, FJLou, YOwens, TDQian, YSo, SThakkar, KCWanner, JMorales, OJ Inhibitors of bruton's tyrosine kinase US Patent  US8729078 Publication Date 5/20/2014 
Target
Name:
Tyrosine-protein kinase BTK
Synonyms:
AGMX1 Agammaglobulinaemia tyrosine kinase B cell progenitor kinase BPK BTK_HUMAN Tyrosine Kinase BTK Tyrosine-protein kinase BTK (BTK)
Type:
Enzyme
Mol. Mass.:
76289.95
Organism:
Homo sapiens (Human)
Description:
Q06187
Residue:
659
  
Inhibitor
Name:
BDBM122409
Synonyms:
US8729078, I-15
Type:
Small organic molecule
Emp. Form.:
C27H24FN5O3
Mol. Mass.:
485.5096
SMILES:
CC(C)(C)c1cc(F)c2c(cnn(-c3cccc(c3CO)-n3cc(C(N)=O)c4cccnc34)c2=O)c1
: