Target
Tyrosine-protein kinase BTK
Ligand
BDBM122414
Substrate
Meas. Tech.
Inhibition Assay
pH
7.2±n/a
IC50
0.18±n/a nM
Comments
extracted
Citation
 Billedeau, RJKondru, RKLopez-Tapia, FJLou, YOwens, TDQian, YSo, SThakkar, KCWanner, JMorales, OJ Inhibitors of bruton's tyrosine kinase US Patent  US8729078 Publication Date 5/20/2014 
Target
Name:
Tyrosine-protein kinase BTK
Synonyms:
AGMX1 Agammaglobulinaemia tyrosine kinase B cell progenitor kinase BPK BTK_HUMAN Tyrosine Kinase BTK Tyrosine-protein kinase BTK (BTK)
Type:
Enzyme
Mol. Mass.:
76289.95
Organism:
Homo sapiens (Human)
Description:
Q06187
Residue:
659
  
Inhibitor
Name:
BDBM122414
Synonyms:
US8729078, I-24
Type:
Small organic molecule
Emp. Form.:
C35H39FN8O4
Mol. Mass.:
654.7338
SMILES:
CC(C)(CN1CCC1)Oc1ccc(Nc2nn(cc2C(N)=O)-c2cccc(c2CO)-n2ncc3cc(cc(F)c3c2=O)C(C)(C)C)nc1
: