Target
Tyrosine-protein kinase BTK
Ligand
BDBM122430
Substrate
Meas. Tech.
Inhibition Assay
pH
7.2±n/a
IC50
333.06±n/a nM
Comments
extracted
Citation
 Billedeau, RJKondru, RKLopez-Tapia, FJLou, YOwens, TDQian, YSo, SThakkar, KCWanner, JMorales, OJ Inhibitors of bruton's tyrosine kinase US Patent  US8729078 Publication Date 5/20/2014 
Target
Name:
Tyrosine-protein kinase BTK
Synonyms:
AGMX1 Agammaglobulinaemia tyrosine kinase B cell progenitor kinase BPK BTK_HUMAN Tyrosine Kinase BTK Tyrosine-protein kinase BTK (BTK)
Type:
Enzyme
Mol. Mass.:
76289.95
Organism:
Homo sapiens (Human)
Description:
Q06187
Residue:
659
  
Inhibitor
Name:
BDBM122430
Synonyms:
US8729078, I-40
Type:
Small organic molecule
Emp. Form.:
C23H22FN5O3
Mol. Mass.:
435.4509
SMILES:
CC(C)(C)c1cc(F)c2c(cnn(-c3cccc(c3CO)-n3ccc(n3)C(N)=O)c2=O)c1
: