Target
Tyrosine-protein kinase BTK
Ligand
BDBM122435
Substrate
Meas. Tech.
Inhibition Assay
pH
7.2±n/a
IC50
11.04±n/a nM
Comments
extracted
Citation
 Billedeau, RJKondru, RKLopez-Tapia, FJLou, YOwens, TDQian, YSo, SThakkar, KCWanner, JMorales, OJ Inhibitors of bruton's tyrosine kinase US Patent  US8729078 Publication Date 5/20/2014 
Target
Name:
Tyrosine-protein kinase BTK
Synonyms:
AGMX1 Agammaglobulinaemia tyrosine kinase B cell progenitor kinase BPK BTK_HUMAN Tyrosine Kinase BTK Tyrosine-protein kinase BTK (BTK)
Type:
Enzyme
Mol. Mass.:
76289.95
Organism:
Homo sapiens (Human)
Description:
Q06187
Residue:
659
  
Inhibitor
Name:
BDBM122435
Synonyms:
US8729078, I-45
Type:
Small organic molecule
Emp. Form.:
C34H31FN6O4
Mol. Mass.:
606.6461
SMILES:
CCOc1ccc(cn1)-c1ccc2c(cn(-c3cccc(c3CO)-n3ncc4cc(cc(F)c4c3=O)C(C)(C)C)c2n1)C(N)=O
: