Target
Methionine aminopeptidase 2
Ligand
BDBM283827
Substrate
Meas. Tech.
recombinant human MetAP2 assay
pH
7.4±n/a
IC50
<50±n/a nM
Comments
extracted
Citation
 Vath, JEZahler, R Fumagillol heterocyclic compounds and methods of making and using same US Patent  US10023561 Publication Date 7/17/2018 
Target
Name:
Methionine aminopeptidase 2
Synonyms:
Initiation factor 2-associated 67 kDa glycoprotein MAP2_HUMAN MNPEP Methionine aminopeptidase 2 (MetAP2) P67EIF2 p67
Type:
Enzyme
Mol. Mass.:
52884.45
Organism:
Homo sapiens (Human)
Description:
P50579
Residue:
478
  
Inhibitor
Name:
BDBM283827
Synonyms:
(3R,4S,5S,6R)-5-methoxy-4-((2R,3R)-2-methyl-3-(3-methylbut-2-en-1-yl)oxiran-2-yl)-1-oxaspiro[2.5]octan-6-yl 3-(2-(ethylamino)ethyl)azetidine-1-carboxylate | US10023561, Example 121
Type:
Small organic molecule
Emp. Form.:
C28H44N2O7
Mol. Mass.:
520.6582
SMILES:
[#6]-[#6]-[#7](-[#6]-[#6]-[#6]-1-[#6]-[#7](-[#6]-1)-[#6](=O)-[#8]-[#6@@H]-1-[#6]-[#6][C@]2([#6]-[#8]2)[#6@H](-[#6@@H]-1-[#8]-[#6])[C@@]1([#6])[#8]-[#6@@H]1-[#6]\[#6]=[#6](\[#6])-[#6])-[#6](=O)-[#8]-[#6]-[#6]=[#6]
: