Target
Methionine aminopeptidase 2
Ligand
BDBM152759
Substrate
Meas. Tech.
recombinant human MetAP2 assay
pH
7.4±n/a
IC50
<50±n/a nM
Comments
extracted
Citation
 Vath, JEZahler, R Fumagillol heterocyclic compounds and methods of making and using same US Patent  US10023561 Publication Date 7/17/2018 
Target
Name:
Methionine aminopeptidase 2
Synonyms:
Initiation factor 2-associated 67 kDa glycoprotein MAP2_HUMAN MNPEP Methionine aminopeptidase 2 (MetAP2) P67EIF2 p67
Type:
Enzyme
Mol. Mass.:
52884.45
Organism:
Homo sapiens (Human)
Description:
P50579
Residue:
478
  
Inhibitor
Name:
BDBM152759
Synonyms:
US10023561, Example 123 | US9682965, 123
Type:
Small organic molecule
Emp. Form.:
C23H38N2O5
Mol. Mass.:
422.5582
SMILES:
[#6]-[#6]-[#7]-[#6]-[#6@H]-1-[#6]-[#6]-[#7]-1-[#6](=O)-[#8]-[#6@@H]-1-[#6]-[#6][C@]2([#6]-[#8]2)[#6@H](-[#6@@H]-1-[#8]-[#6])[C@@]1([#6])[#8]-[#6@@H]1-[#6]\[#6]=[#6](\[#6])-[#6]
: