Target
Interleukin-1 receptor-associated kinase 4
Ligand
BDBM283845
Substrate
Meas. Tech.
IRAK4 Inhibition Assay
pH
7.2±n/a
Temperature
298.15±n/a K
IC50
4.00±n/a nM
Comments
extracted
Citation
 Bhide, RSDuncia, JVHynes, JNair, SKPitts, WJKumar, SRGardner, DSMurugesan, NPaidi, VRSantella, JBSistla, RWu, H Heteroaryl substituted pyridyl compounds useful as kinase modulators US Patent  US10023562 Publication Date 7/17/2018 
Target
Name:
Interleukin-1 receptor-associated kinase 4
Synonyms:
IRAK-4 IRAK4_HUMAN Interleukin-1 receptor-associated kinase 4 (IRAK4) | Renal carcinoma antigen NY-REN-64
Type:
Protein
Mol. Mass.:
51519.08
Organism:
Homo sapiens (Human)
Description:
Q9NWZ3
Residue:
460
  
Inhibitor
Name:
BDBM283845
Synonyms:
US10023562, Example 37
Type:
Small organic molecule
Emp. Form.:
C21H26F2N6O2
Mol. Mass.:
435.4854
SMILES:
[2H]C([2H])([2H])OC(C)(C)[C@H](F)CNC(=O)c1cnc(Nc2ncc(cc2F)C#N)cc1NC(C)C
: