Target
Lysine-specific histone demethylase 1A
Ligand
BDBM50346863
Substrate
Meas. Tech.
Biological Assay
pH
7.5±n/a
Ki
1100±n/a nM
Comments
extracted
Citation
 Minucci, SMai, AMattevi, A Tranylcypromine derivatives as inhibitors of histone demethylases LSD1 and/or LSD2 US Patent  US8765820 Publication Date 7/1/2014 
Target
Name:
Lysine-specific histone demethylase 1A
Synonyms:
AOF2 Flavin-containing amine oxidase domain-containing protein 2 KDM1A KIAA0601 Lysine-specific demethylase 1 (LSD1) Lysine-specific histone demethylase 1 (LSD1)
Type:
Enzyme
Mol. Mass.:
92901.01
Organism:
Homo sapiens (Human)
Description:
O60341
Residue:
852
  
Inhibitor
Name:
BDBM50346863
Synonyms:
CHEMBL1797640 | US8765820, 5b
Type:
Small organic molecule
Emp. Form.:
C16H16N2O
Mol. Mass.:
252.311
SMILES:
NC1CC1c1ccc(NC(=O)c2ccccc2)cc1
: