Target
Arachidonate 5-lipoxygenase-activating protein
Ligand
BDBM125944
Substrate
Meas. Tech.
Scintillation Proximity Assay
pH
7.5±n/a
IC50
86±n/a nM
Comments
extracted
Citation
 De Lombaert, SLiu, WLo, HYNemoto, PA Benzimidazole inhibitors of leukotriene production US Patent  US8772304 Publication Date 7/8/2014 
Target
Name:
Arachidonate 5-lipoxygenase-activating protein
Synonyms:
5-lipoxygenase activating protein 5-lipoxygenase/FLAP ALOX5AP MK-886-binding protein
Type:
Enzyme
Mol. Mass.:
18159.90
Organism:
Homo sapiens (Human)
Description:
P20292
Residue:
161
  
Inhibitor
Name:
BDBM125944
Synonyms:
US8772304, 6
Type:
Small organic molecule
Emp. Form.:
C25H22N10
Mol. Mass.:
462.5092
SMILES:
Cc1ncnn1-c1ccc(nc1-c1nc2cc(ccc2n1C1(C)CCC1)-c1cnc(N)nc1)C#N
: