Target
Cyclin-T1
Ligand
BDBM126547
Substrate
Meas. Tech.
IMAP Assay
IC50
0.00017±n/a nM
Citation
 Barsanti, PAHu, CJin, JKeyes, RKucejko, RLin, XPan, YPfister, KBSendzik, MSutton, JWan, L Heteroaryl compounds and their uses US Patent  US8778951 Publication Date 7/15/2014 
Target
Name:
Cyclin-T1
Synonyms:
CCNT1 CycT Cyclin T Cyclin-T
Type:
Enzyme Subunit
Mol. Mass.:
80712.40
Organism:
Homo sapiens (Human)
Description:
Residue:
726
  
Inhibitor
Name:
BDBM126547
Synonyms:
US8778951, 358
Type:
Small organic molecule
Emp. Form.:
C27H37ClN6O2
Mol. Mass.:
513.075
SMILES:
COC[C@@H](C)N[C@H]1CC[C@@H](CC1)Nc1cc(c(Cl)cn1)-c1cccc(NCC2(CCOCC2)C#N)n1
: