Target
Nicotinate-nucleotide adenylyltransferase
Ligand
BDBM81358
Substrate
Meas. Tech.
Enzyme Inhibition Assay
pH
7.5±n/a
Temperature
298.15±n/a K
IC50
51000±n/a nM
Comments
extracted
Citation
 Mackerell, Jr., AZhang, HOsterman, AKolhatkar, R Targeting NAD biosynthesis in bacterial pathogens US Patent  US8785499 Publication Date 7/22/2014 
Target
Name:
Nicotinate-nucleotide adenylyltransferase
Synonyms:
Deamido-NAD(+) pyrophosphorylase Nicotinate mononucleotide adenylyltransferase (NadD) nadD | ybeN
Type:
Enzyme
Mol. Mass.:
24523.61
Organism:
Escherichia coli
Description:
P0A752
Residue:
213
  
Inhibitor
Name:
BDBM81358
Synonyms:
NadD inhibitor 3_15 | US8785499, 3_15
Type:
Small organic molecule
Emp. Form.:
C18H11ClFN3OS2
Mol. Mass.:
403.881
SMILES:
Nc1c(sc2nc(ccc12)-c1cccs1)C(=O)Nc1ccc(Cl)cc1F
: