Target
Nicotinate-nucleotide adenylyltransferase
Ligand
BDBM81362
Substrate
Meas. Tech.
Enzyme Inhibition Assay
pH
7.5±n/a
Temperature
298.15±n/a K
IC50
191000±n/a nM
Comments
extracted
Citation
 Mackerell, Jr., AZhang, HOsterman, AKolhatkar, R Targeting NAD biosynthesis in bacterial pathogens US Patent  US8785499 Publication Date 7/22/2014 
Target
Name:
Nicotinate-nucleotide adenylyltransferase
Synonyms:
Deamido-NAD(+) pyrophosphorylase Nicotinate mononucleotide adenylyltransferase (NadD) nadD | ybeN
Type:
Enzyme
Mol. Mass.:
24523.61
Organism:
Escherichia coli
Description:
P0A752
Residue:
213
  
Inhibitor
Name:
BDBM81362
Synonyms:
NadD inhibitor 15_11 | US8785499, 15_11
Type:
Small organic molecule
Emp. Form.:
C17H14N2O3
Mol. Mass.:
294.3047
SMILES:
COC(=O)c1ccc(cc1)N=CC1C(=O)Nc2ccccc12
: