Target
Neuraminidase
Ligand
BDBM4756
Substrate
BDBM4702
Meas. Tech.
Neuraminidase Inhibition Assay
IC50
>30000±n/a nM
Citation
 Chand, PBabu, YSBantia, SRowland, SDehghani, AKotian, PLHutchison, TLAli, SBrouillette, WEl-Kattan, YLin, TH Syntheses and neuraminidase inhibitory activity of multisubstituted cyclopentane amide derivatives. J Med Chem 47:1919-29 (2004)  
Target
Name:
Neuraminidase
Synonyms:
Influenza B Virus Neuraminidase NRAM_INBLE Neuraminidase B
Type:
Enzyme
Mol. Mass.:
51446.67
Organism:
Influenza B virus (B/Lee/40)
Description:
Residue:
466
  
Inhibitor
Name:
BDBM4756
Synonyms:
(3S,4S)-3-carbamimidamido-4-[(S)-acetamido[hexyl(methyl)carbamoyl]methyl]cyclopentane-1-carboxylic acid | Cyclopentane Amide deriv. 15e
Type:
Small organic molecule
Emp. Form.:
C18H33N5O4
Mol. Mass.:
383.4857
SMILES:
[#6]-[#6]-[#6]-[#6]-[#6]-[#6]-[#7](-[#6])-[#6](=O)-[#6](-[#7]-[#6](-[#6])=O)-[#6@H]-1-[#6]-[#6](-[#6]-[#6@@H]-1\[#7]=[#6](\[#7])-[#7])-[#6](-[#8])=O
:
Substrate
Name:
BDBM4702
Synonyms:
(2R,4S,5R,6R)-5-acetamido-4-hydroxy-2-[(4-methyl-2-oxo-2H-chromen-7-yl)oxy]-6-[(1R,2R)-1,2,3-trihydroxypropyl]oxane-2-carboxylic acid neuraminidase substrate
Type:
Small organic molecule
Emp. Form.:
C21H25NO11
Mol. Mass.:
467.4233
SMILES:
CC(=O)N[C@@H]1[C@@H](O)C[C@](Oc2ccc3c(C)cc(=O)oc3c2)(O[C@H]1[C@H](O)[C@H](O)CO)C(O)=O
: