Target
Mitogen-activated protein kinase kinase kinase 5
Ligand
BDBM128409
Substrate
Meas. Tech.
Scintillation Assay
pH
7.5±n/a
Temperature
298.15±n/a K
IC50
60±n/a nM
Comments
extracted
Citation
 Chang, E Apoptosis signal-regulating kinase 1 inhibitors US Patent  US8802695 Publication Date 8/12/2014 
Target
Name:
Mitogen-activated protein kinase kinase kinase 5
Synonyms:
ASK1 MAP3K5 MEKK5
Type:
Protein
Mol. Mass.:
154514.93
Organism:
Homo sapiens (Human)
Description:
Q99683
Residue:
1374
  
Inhibitor
Name:
BDBM128409
Synonyms:
US8802695, 25
Type:
Small organic molecule
Emp. Form.:
C18H17Cl2N3O2
Mol. Mass.:
378.252
SMILES:
Cn1c(Cl)c(Cl)c2cnc(NC(=O)c3ccc(cc3)C(C)(C)O)cc12
: