Target
Mitogen-activated protein kinase kinase kinase 5
Ligand
BDBM128412
Substrate
Meas. Tech.
Homogeneous Time-Resolved Fluorescence Assay
pH
7.3±n/a
Temperature
298.15±n/a K
IC50
16±n/a nM
Comments
extracted
Citation
 Chang, E Apoptosis signal-regulating kinase 1 inhibitors US Patent  US8802695 Publication Date 8/12/2014 
Target
Name:
Mitogen-activated protein kinase kinase kinase 5
Synonyms:
ASK1 MAP3K5 MEKK5
Type:
Protein
Mol. Mass.:
154514.93
Organism:
Homo sapiens (Human)
Description:
Q99683
Residue:
1374
  
Inhibitor
Name:
BDBM128412
Synonyms:
US8802695, 28
Type:
Small organic molecule
Emp. Form.:
C21H22ClN3O2
Mol. Mass.:
383.871
SMILES:
CC(C)(CO)c1ccc(cc1)C(=O)Nc1cc2n(cc(Cl)c2cn1)C1CC1
: