Target
Mitogen-activated protein kinase kinase kinase 5
Ligand
BDBM128415
Substrate
Meas. Tech.
Homogeneous Time-Resolved Fluorescence Assay
pH
7.3±n/a
Temperature
298.15±n/a K
IC50
122±n/a nM
Comments
extracted
Citation
 Chang, E Apoptosis signal-regulating kinase 1 inhibitors US Patent  US8802695 Publication Date 8/12/2014 
Target
Name:
Mitogen-activated protein kinase kinase kinase 5
Synonyms:
ASK1 MAP3K5 MEKK5
Type:
Protein
Mol. Mass.:
154514.93
Organism:
Homo sapiens (Human)
Description:
Q99683
Residue:
1374
  
Inhibitor
Name:
BDBM128415
Synonyms:
US8802695, 32
Type:
Small organic molecule
Emp. Form.:
C18H17Cl2N3O3
Mol. Mass.:
394.252
SMILES:
Cn1c(Cl)c(Cl)c2cnc(NC(=O)c3ccc(cc3)[C@@](C)(O)CO)cc12
: