Target
Cyclin-dependent kinase 1
Ligand
BDBM129355
Substrate
Meas. Tech.
Kinase Assay
pH
8±n/a
Temperature
295.15±n/a K
IC50
130±n/a nM
Comments
extracted
Citation
 Lücking, USiemeister, GLienau, PJautelat, RSchulze, J Sulfone-substituted anilinopyrimidine derivatives as CDK inhibitors, the production thereof, and use as a medicine US Patent  US8802686 Publication Date 8/12/2014 
Target
Name:
Cyclin-dependent kinase 1
Synonyms:
CDC2 CDK1 CDKN1 Cell division protein kinase 1 P34CDC2 | p34 protein kinase
Type:
Enzyme Subunit
Mol. Mass.:
34101.08
Organism:
Homo sapiens (Human)
Description:
P06493
Residue:
297
  
Inhibitor
Name:
BDBM129355
Synonyms:
US8802686, 13
Type:
Small organic molecule
Emp. Form.:
C15H12F3N3O3S
Mol. Mass.:
371.334
SMILES:
CS(=O)(=O)c1ccc(Nc2ncc(c(OCC#C)n2)C(F)(F)F)cc1
: