Target
Muscarinic acetylcholine receptor M3
Ligand
BDBM103811
Substrate
Meas. Tech.
Radioligand Binding Assay
Ki
0.1±n/a nM
Citation
 Hughes, ADChen, YJacobsen, JRStangeland, ELYen, R Diamide compounds having muscarinic receptor antagonist and β2 adrenergic receptor agonist activity US Patent  US8816088 Publication Date 8/26/2014 
Target
Name:
Muscarinic acetylcholine receptor M3
Synonyms:
ACM3_HUMAN Cholinergic, muscarinic M3 Muscarinic receptor M3 | RecName: Full=Muscarinic acetylcholine receptor M3
Type:
Enzyme
Mol. Mass.:
66151.03
Organism:
Homo sapiens (Human)
Description:
P20309
Residue:
590
  
Inhibitor
Name:
BDBM103811
Synonyms:
US8551978, I-81 US9394275, I-81 US9682957, I-81
Type:
Small organic molecule
Emp. Form.:
C52H58N6O8
Mol. Mass.:
895.0523
SMILES:
COc1ccc(CC(=O)NCc2ccc(cc2)N(C)C(=O)CCN2CCC(CC2)OC(=O)Nc2ccccc2-c2ccccc2)cc1CC(C)NC[C@H](O)c1ccc(O)c2[nH]c(=O)ccc12
: