Target
Muscarinic acetylcholine receptor M3
Ligand
BDBM103806
Substrate
Meas. Tech.
Radioligand Binding Assay
Ki
0.3±n/a nM
Citation
 Hughes, ADChen, YJacobsen, JRStangeland, ELYen, R Diamide compounds having muscarinic receptor antagonist and β2 adrenergic receptor agonist activity US Patent  US8816088 Publication Date 8/26/2014 
Target
Name:
Muscarinic acetylcholine receptor M3
Synonyms:
ACM3_HUMAN Cholinergic, muscarinic M3 Muscarinic receptor M3 | RecName: Full=Muscarinic acetylcholine receptor M3
Type:
Enzyme
Mol. Mass.:
66151.03
Organism:
Homo sapiens (Human)
Description:
P20309
Residue:
590
  
Inhibitor
Name:
BDBM103806
Synonyms:
US8551978, I-76 US9394275, I-76 US9682957, I-76
Type:
Small organic molecule
Emp. Form.:
C50H54N6O7
Mol. Mass.:
850.9998
SMILES:
CN(C(=O)CCN1CCC(CC1)OC(=O)Nc1ccccc1-c1ccccc1)c1ccc(CNC(=O)Cc2cccc(CCNC[C@H](O)c3ccc(O)c4[nH]c(=O)ccc34)c2)cc1
: