Target
5-hydroxytryptamine receptor 2A
Ligand
BDBM130252
Substrate
Meas. Tech.
Binding Assay
pH
7.7±n/a
Temperature
277.15±n/a K
IC50
448±n/a nM
Comments
extracted
Citation
 Lee, KHYi, HJCho, HIm, DJChae, EHChoi, YJ Carbamoyloxy arylalkan arylpiperazine analgesics US Patent  US8815852 Publication Date 8/26/2014 
Target
Name:
5-hydroxytryptamine receptor 2A
Synonyms:
5-HT-2A 5-HT2A 5-hydroxytryptamine receptor 2A (5HT2A) Htr2 Serotonin Receptor 2A
Type:
G Protein-Coupled Receptor (GPCR)
Mol. Mass.:
52852.05
Organism:
Rattus norvegicus (rat)
Description:
Rat cortex membranes 5-HT2A receptors.
Residue:
471
  
Inhibitor
Name:
BDBM130252
Synonyms:
US8815852, 25
Type:
Small organic molecule
Emp. Form.:
C19H24N4O2
Mol. Mass.:
340.4195
SMILES:
NC(=O)OC(CCN1CCN(CC1)c1ccccn1)c1ccccc1
: