Target
Ketohexokinase
Ligand
BDBM130570
Substrate
Meas. Tech.
Enzyme Assay
Temperature
298.15±n/a K
IC50
890±n/a nM
Comments
extracted
Citation
 Zhang, XAbad, MCGibbs, ACKuo, GKuo, LCSong, FSui, Z Indazole compounds useful as ketohexokinase inhibitors US Patent  US8822447 Publication Date 9/2/2014 
Target
Name:
Ketohexokinase
Synonyms:
Hepatic fructokinase KHK_HUMAN Ketohexokinase (KHK) | Ketohexokinase (KHK) Isoform C
Type:
Enzyme Catalytic Domain
Mol. Mass.:
32521.64
Organism:
Homo sapiens (Human)
Description:
Residue:
298
  
Inhibitor
Name:
BDBM130570
Synonyms:
US8822447, 36 | US9771375, Example 36
Type:
Small organic molecule
Emp. Form.:
C24H31N5
Mol. Mass.:
389.5364
SMILES:
CCc1nn(-c2ccccc2)c2cc(ccc12)N1CCC(CC1)N1CCNCC1
: