Target
High affinity cGMP-specific 3',5'-cyclic phosphodiesterase 9A
Ligand
BDBM130736
Substrate
Meas. Tech.
Inhibition Assay
pH
8±n/a
IC50
5±n/a nM
Comments
extracted
Citation
 Kaizawa, HYamamoto, HKamijo, KSugita, MSeo, RYamamoto, SUkai, A Pyrazoloquinoline compound US Patent  US8822448 Publication Date 9/2/2014 
Target
Name:
High affinity cGMP-specific 3',5'-cyclic phosphodiesterase 9A
Synonyms:
PDE9A_RAT Phosphodiesterase 9 (PDE9)
Type:
Enzyme
Mol. Mass.:
61749.01
Organism:
Rattus norvegicus (Rat)
Description:
Q8QZV1
Residue:
534
  
Inhibitor
Name:
BDBM130736
Synonyms:
US8822448, 127
Type:
Small organic molecule
Emp. Form.:
C27H37N5O4
Mol. Mass.:
495.6138
SMILES:
COCCCCN(C)[C@H]1CCN(C1)C(=O)c1cc2c3n(ncc3c(=O)[nH]c2cc1C)C1CCOCC1
: