Target
High affinity cGMP-specific 3',5'-cyclic phosphodiesterase 9A
Ligand
BDBM130780
Substrate
Meas. Tech.
Inhibition Assay
pH
8±n/a
IC50
1.3±n/a nM
Comments
extracted
Citation
 Kaizawa, HYamamoto, HKamijo, KSugita, MSeo, RYamamoto, SUkai, A Pyrazoloquinoline compound US Patent  US8822448 Publication Date 9/2/2014 
Target
Name:
High affinity cGMP-specific 3',5'-cyclic phosphodiesterase 9A
Synonyms:
PDE9A_RAT Phosphodiesterase 9 (PDE9)
Type:
Enzyme
Mol. Mass.:
61749.01
Organism:
Rattus norvegicus (Rat)
Description:
Q8QZV1
Residue:
534
  
Inhibitor
Name:
BDBM130780
Synonyms:
US8822448, 210
Type:
Small organic molecule
Emp. Form.:
C24H28F3N5O2
Mol. Mass.:
475.5066
SMILES:
C[C@H]1CN(CCN1CCC(F)(F)F)C(=O)c1cc2c3n(CC4CC4)ncc3c(=O)[nH]c2cc1C
: