Target
Acetyl-CoA carboxylase 2
Ligand
BDBM131412
Substrate
Meas. Tech.
Spectrophotometric 384 Well Assay
pH
7.5±n/a
IC50
13900±n/a nM
Comments
extracted
Citation
 Roth, GJFleck, MHeine, NKley, JLehmann-Lintz, TNeubauer, HNosse, B Compounds, pharmaceutical compositions and uses thereof US Patent  US8835472 Publication Date 9/16/2014 
Target
Name:
Acetyl-CoA carboxylase 2
Synonyms:
ACACB ACC-beta ACCB Acetyl-CoA carboxylase 2 Acetyl-CoA carboxylase 2 (ACC2)
Type:
Protein
Mol. Mass.:
276535.21
Organism:
Homo sapiens (Human)
Description:
O00763
Residue:
2458
  
Inhibitor
Name:
BDBM131412
Synonyms:
US8835472, 11.34
Type:
Small organic molecule
Emp. Form.:
C21H24N4O2
Mol. Mass.:
364.4409
SMILES:
COC1CN(C1)c1nccc(n1)C#Cc1ccc(CC(C)NC(C)=O)cc1
: