Target
Sodium/glucose cotransporter 1
Ligand
BDBM132860
Substrate
Meas. Tech.
Inhibition Assay
Temperature
310.15±n/a K
IC50
1.3±n/a nM
Comments
extracted
Citation
 Miura, TOgoshi, YUeyama, KMotoda, DIwayama, TSuzawa, KNagamori, HUeno, HTakahashi, ASugimoto, K Pyrazole compound and pharmaceutical use thereof US Patent  US8846746 Publication Date 9/30/2014 
Target
Name:
Sodium/glucose cotransporter 1
Synonyms:
High affinity sodium-glucose cotransporter Na(+)/glucose cotransporter 1 SGLT1 Sodium-dependent glucose cotransporter 1 (SGLT1) Sodium/glucose cotransporter 1 (SGLT1) | Solute carrier family 5 member 1
Type:
Protein
Mol. Mass.:
73503.78
Organism:
Homo sapiens (Human)
Description:
P13866
Residue:
664
  
Inhibitor
Name:
BDBM132860
Synonyms:
US8846746, 130
Type:
Small organic molecule
Emp. Form.:
C21H16ClF3N4O3
Mol. Mass.:
464.825
SMILES:
FC(F)(F)Oc1cccc(c1)-c1cc(NC(=O)[C@H]2CNC(=O)C2)nn1-c1ccccc1Cl
: