Target
Sodium/glucose cotransporter 1
Ligand
BDBM132915
Substrate
Meas. Tech.
Inhibition Assay
Temperature
310.15±n/a K
IC50
1.3±n/a nM
Comments
extracted
Citation
 Miura, TOgoshi, YUeyama, KMotoda, DIwayama, TSuzawa, KNagamori, HUeno, HTakahashi, ASugimoto, K Pyrazole compound and pharmaceutical use thereof US Patent  US8846746 Publication Date 9/30/2014 
Target
Name:
Sodium/glucose cotransporter 1
Synonyms:
High affinity sodium-glucose cotransporter Na(+)/glucose cotransporter 1 SGLT1 Sodium-dependent glucose cotransporter 1 (SGLT1) Sodium/glucose cotransporter 1 (SGLT1) | Solute carrier family 5 member 1
Type:
Protein
Mol. Mass.:
73503.78
Organism:
Homo sapiens (Human)
Description:
P13866
Residue:
664
  
Inhibitor
Name:
BDBM132915
Synonyms:
US8846746, 193
Type:
Small organic molecule
Emp. Form.:
C22H18ClF3N4O3
Mol. Mass.:
478.852
SMILES:
C[C@@H]1[C@H](CNC1=O)C(=O)Nc1cc(-c2cccc(OC(F)(F)F)c2)n(n1)-c1ccccc1Cl
: