Target
Sodium/glucose cotransporter 1
Ligand
BDBM133004
Substrate
Meas. Tech.
Inhibition Assay
Temperature
310.15±n/a K
IC50
1.5±n/a nM
Comments
extracted
Citation
 Miura, TOgoshi, YUeyama, KMotoda, DIwayama, TSuzawa, KNagamori, HUeno, HTakahashi, ASugimoto, K Pyrazole compound and pharmaceutical use thereof US Patent  US8846746 Publication Date 9/30/2014 
Target
Name:
Sodium/glucose cotransporter 1
Synonyms:
High affinity sodium-glucose cotransporter Na(+)/glucose cotransporter 1 SGLT1 Sodium-dependent glucose cotransporter 1 (SGLT1) Sodium/glucose cotransporter 1 (SGLT1) | Solute carrier family 5 member 1
Type:
Protein
Mol. Mass.:
73503.78
Organism:
Homo sapiens (Human)
Description:
P13866
Residue:
664
  
Inhibitor
Name:
BDBM133004
Synonyms:
US8846746, 302
Type:
Small organic molecule
Emp. Form.:
C24H27N3O3S
Mol. Mass.:
437.554
SMILES:
CCCc1cccc(c1)-c1cc(NC(=O)C2CCS(=O)(=O)CC2)nn1-c1ccccc1
: