Target
Sodium/glucose cotransporter 1
Ligand
BDBM133135
Substrate
Meas. Tech.
Inhibition Assay
Temperature
310.15±n/a K
IC50
1.7±n/a nM
Comments
extracted
Citation
 Miura, TOgoshi, YUeyama, KMotoda, DIwayama, TSuzawa, KNagamori, HUeno, HTakahashi, ASugimoto, K Pyrazole compound and pharmaceutical use thereof US Patent  US8846746 Publication Date 9/30/2014 
Target
Name:
Sodium/glucose cotransporter 1
Synonyms:
High affinity sodium-glucose cotransporter Na(+)/glucose cotransporter 1 SGLT1 Sodium-dependent glucose cotransporter 1 (SGLT1) Sodium/glucose cotransporter 1 (SGLT1) | Solute carrier family 5 member 1
Type:
Protein
Mol. Mass.:
73503.78
Organism:
Homo sapiens (Human)
Description:
P13866
Residue:
664
  
Inhibitor
Name:
BDBM133135
Synonyms:
US8846746, 453
Type:
Small organic molecule
Emp. Form.:
C27H29F3N4O4
Mol. Mass.:
530.5388
SMILES:
CCCOc1cccc(c1)-n1nc(NC(=O)[C@@H]2CNC(=O)C2)cc1-c1cccc(CO[C@H](C)C(F)(F)F)c1
: