Target
Metabotropic glutamate receptor 5
Ligand
BDBM136006
Substrate
Meas. Tech.
Fluorometric Imaging Plate Reader (FLIPR) Assay
IC50
345±n/a nM
Citation
 Behnke, DCarcache, DErtl, PKoller, MOrain, D Diazepinone derivatives US Patent  US8853203 Publication Date 10/7/2014 
Target
Name:
Metabotropic glutamate receptor 5
Synonyms:
GPRC1E GRM5_HUMAN metabotropic glutamate 5 | metabotropic glutamate 5a
Type:
Enzyme
Mol. Mass.:
132484.72
Organism:
Homo sapiens (Human)
Description:
Residue:
1212
  
Inhibitor
Name:
BDBM136006
Synonyms:
US8853203, 61 | US9650377, Example 61
Type:
Small organic molecule
Emp. Form.:
C20H22N4O2
Mol. Mass.:
350.4143
SMILES:
COc1cccc2C3=CC(=NCC(=O)N3CCc12)n1cnc(c1)C(C)C
: