Target
Regulator of G-protein signaling 19
Ligand
BDBM50384774
Substrate
Meas. Tech.
Inhibitory Assay
IC50
120±n/a nM
Citation
 Neubig, RBlazer, LHusbands, SLarsen, STraynor, J Small molecule inhibitors of RGS proteins US Patent  US8865750 Publication Date 10/21/2014 
Target
Name:
Regulator of G-protein signaling 19
Synonyms:
G protein signalling regulator 19 GNAI3IP RGS19_HUMAN | Regulator of G-protein signaling 19 (RGS19)
Type:
Enzyme Catalytic Domain
Mol. Mass.:
24631.38
Organism:
Homo sapiens (Human)
Description:
gi_86990435
Residue:
217
  
Inhibitor
Name:
BDBM50384774
Synonyms:
CHEMBL1917204 | US20230414581, Compound 6
Type:
Small organic molecule
Emp. Form.:
C16H13FN2O2S
Mol. Mass.:
316.35
SMILES:
Cc1ccc(cc1)-n1sc(=O)n(Cc2ccc(F)cc2)c1=O
: