Target
Regulator of G-protein signaling 8
Ligand
BDBM136368
Substrate
Meas. Tech.
Inhibitory Assay
IC50
>100000±n/a nM
Citation
 Neubig, RBlazer, LHusbands, SLarsen, STraynor, J Small molecule inhibitors of RGS proteins US Patent  US8865750 Publication Date 10/21/2014 
Target
Name:
Regulator of G-protein signaling 8
Synonyms:
RGS8 Regulator of G-protein signaling 8 (RGS8)
Type:
Enzyme Catalytic Domain
Mol. Mass.:
20925.80
Organism:
Homo sapiens (Human)
Description:
gi_74355113
Residue:
180
  
Inhibitor
Name:
BDBM136368
Synonyms:
US8865750, CCG- 203778
Type:
Small organic molecule
Emp. Form.:
C18H18N2O2
Mol. Mass.:
294.3477
SMILES:
Cc1ccc(CN2C(=O)CN(C2=O)c2ccc(C)cc2)cc1
: