Target
Regulator of G-protein signaling 8
Ligand
BDBM50384773
Substrate
Meas. Tech.
Inhibitory Assay
IC50
>100000±n/a nM
Citation
 Neubig, RBlazer, LHusbands, SLarsen, STraynor, J Small molecule inhibitors of RGS proteins US Patent  US8865750 Publication Date 10/21/2014 
Target
Name:
Regulator of G-protein signaling 8
Synonyms:
RGS8 Regulator of G-protein signaling 8 (RGS8)
Type:
Enzyme Catalytic Domain
Mol. Mass.:
20925.80
Organism:
Homo sapiens (Human)
Description:
gi_74355113
Residue:
180
  
Inhibitor
Name:
BDBM50384773
Synonyms:
CHEMBL2037371
Type:
Small organic molecule
Emp. Form.:
C18H15NO2
Mol. Mass.:
277.3172
SMILES:
Cc1ccc(cc1)C1=CC(=O)N(Cc2ccccc2)C1=O
: