Target
Serine hydroxymethyltransferase, mitochondrial
Ligand
BDBM285662
Substrate
Meas. Tech.
Inhibition of Human SHMT
pH
7.4±n/a
IC50
1.000±n/a nM
Comments
extracted
Citation
 Rabinowitz, JDKim, HDucker, GSGhergurovich, JM SHMT inhibitors US Patent  US10077273 Publication Date 9/18/2018 
Target
Name:
Serine hydroxymethyltransferase, mitochondrial
Synonyms:
GLYM_HUMAN SHMT Serine methylase
Type:
Enzyme Catalytic Domain
Mol. Mass.:
56004.42
Organism:
Homo sapiens (Human)
Description:
Residue:
504
  
Inhibitor
Name:
BDBM285662
Synonyms:
US10077273, Compound 70 US10934305, Compound 70
Type:
Small organic molecule
Emp. Form.:
C28H28F3N5O6
Mol. Mass.:
587.547
SMILES:
CC(C)C1(c2c(C)n[nH]c2OC(N)=C1C#N)c1cc(cc(c1)C(F)(F)F)C#CCCC(=O)N[C@H](CCC(O)=O)C(O)=O
: