Target
Serine hydroxymethyltransferase, mitochondrial
Ligand
BDBM285667
Substrate
Meas. Tech.
Inhibition of Human SHMT
pH
7.4±n/a
IC50
7.50±n/a nM
Comments
extracted
Citation
 Rabinowitz, JDKim, HDucker, GSGhergurovich, JM SHMT inhibitors US Patent  US10077273 Publication Date 9/18/2018 
Target
Name:
Serine hydroxymethyltransferase, mitochondrial
Synonyms:
GLYM_HUMAN SHMT Serine methylase
Type:
Enzyme Catalytic Domain
Mol. Mass.:
56004.42
Organism:
Homo sapiens (Human)
Description:
Residue:
504
  
Inhibitor
Name:
BDBM285667
Synonyms:
US10077273, Compound 73 US10934305, Compound 73
Type:
Small organic molecule
Emp. Form.:
C24H23F3N4O3
Mol. Mass.:
472.4596
SMILES:
COC(=O)CCC#Cc1cc(cc(c1)C1(C(C)C)c2c(C)n[nH]c2OC(N)=C1C#N)C(F)(F)F
: