Target
Serine hydroxymethyltransferase, mitochondrial
Ligand
BDBM285674
Substrate
Meas. Tech.
Inhibition of Human SHMT
pH
7.4±n/a
IC50
1768±n/a nM
Comments
extracted
Citation
 Rabinowitz, JDKim, HDucker, GSGhergurovich, JM SHMT inhibitors US Patent  US10077273 Publication Date 9/18/2018 
Target
Name:
Serine hydroxymethyltransferase, mitochondrial
Synonyms:
GLYM_HUMAN SHMT Serine methylase
Type:
Enzyme Catalytic Domain
Mol. Mass.:
56004.42
Organism:
Homo sapiens (Human)
Description:
Residue:
504
  
Inhibitor
Name:
BDBM285674
Synonyms:
US10077273, Compound HK-4
Type:
Small organic molecule
Emp. Form.:
C19H17F3N4O
Mol. Mass.:
374.3597
SMILES:
Cc1n[nH]c2OC(N)=C(C#N)[C@@](C3CCC3)(c12)c1cccc(c1)C(F)(F)F
: