Target
Serine hydroxymethyltransferase, mitochondrial
Ligand
BDBM285675
Substrate
Meas. Tech.
Inhibition of Human SHMT
pH
7.4±n/a
IC50
756±n/a nM
Comments
extracted
Citation
 Rabinowitz, JDKim, HDucker, GSGhergurovich, JM SHMT inhibitors US Patent  US10077273 Publication Date 9/18/2018 
Target
Name:
Serine hydroxymethyltransferase, mitochondrial
Synonyms:
GLYM_HUMAN SHMT Serine methylase
Type:
Enzyme Catalytic Domain
Mol. Mass.:
56004.42
Organism:
Homo sapiens (Human)
Description:
Residue:
504
  
Inhibitor
Name:
BDBM285675
Synonyms:
US10077273, Compound HK-5
Type:
Small organic molecule
Emp. Form.:
C18H17F3N4O
Mol. Mass.:
362.349
SMILES:
CC(C)[C@@]1(c2c(C)n[nH]c2OC(N)=C1C#N)c1cccc(c1)C(F)(F)F
: