Target
Serine hydroxymethyltransferase, mitochondrial
Ligand
BDBM285679
Substrate
Meas. Tech.
Inhibition of Human SHMT
pH
7.4±n/a
IC50
3464±n/a nM
Comments
extracted
Citation
 Rabinowitz, JDKim, HDucker, GSGhergurovich, JM SHMT inhibitors US Patent  US10077273 Publication Date 9/18/2018 
Target
Name:
Serine hydroxymethyltransferase, mitochondrial
Synonyms:
GLYM_HUMAN SHMT Serine methylase
Type:
Enzyme Catalytic Domain
Mol. Mass.:
56004.42
Organism:
Homo sapiens (Human)
Description:
Residue:
504
  
Inhibitor
Name:
BDBM285679
Synonyms:
US10077273, Compound HK-9 | US10934305, Compound HK-9
Type:
Small organic molecule
Emp. Form.:
C19H19ClN4O2
Mol. Mass.:
370.833
SMILES:
COc1cc(Cl)cc(c1)C1(C2CCC2)c2c(C)n[nH]c2OC(N)=C1C#N
: