Target
Serine hydroxymethyltransferase, mitochondrial
Ligand
BDBM285680
Substrate
Meas. Tech.
Inhibition of Human SHMT
pH
7.4±n/a
IC50
1193±n/a nM
Comments
extracted
Citation
 Rabinowitz, JDKim, HDucker, GSGhergurovich, JM SHMT inhibitors US Patent  US10077273 Publication Date 9/18/2018 
Target
Name:
Serine hydroxymethyltransferase, mitochondrial
Synonyms:
GLYM_HUMAN SHMT Serine methylase
Type:
Enzyme Catalytic Domain
Mol. Mass.:
56004.42
Organism:
Homo sapiens (Human)
Description:
Residue:
504
  
Inhibitor
Name:
BDBM285680
Synonyms:
US10077273, Compound HK-10 | US10934305, Compound HK-10
Type:
Small organic molecule
Emp. Form.:
C18H16Cl2N4O
Mol. Mass.:
375.252
SMILES:
Cc1n[nH]c2OC(N)=C(C#N)C(C3CCC3)(c12)c1cc(Cl)cc(Cl)c1
: