Target
Serine hydroxymethyltransferase, mitochondrial
Ligand
BDBM285682
Substrate
Meas. Tech.
Inhibition of Human SHMT
pH
7.4±n/a
IC50
168±n/a nM
Comments
extracted
Citation
 Rabinowitz, JDKim, HDucker, GSGhergurovich, JM SHMT inhibitors US Patent  US10077273 Publication Date 9/18/2018 
Target
Name:
Serine hydroxymethyltransferase, mitochondrial
Synonyms:
GLYM_HUMAN SHMT Serine methylase
Type:
Enzyme Catalytic Domain
Mol. Mass.:
56004.42
Organism:
Homo sapiens (Human)
Description:
Residue:
504
  
Inhibitor
Name:
BDBM285682
Synonyms:
US10077273, Compound HK-12 | US10934305, Compound HK-12
Type:
Small organic molecule
Emp. Form.:
C20H16F6N4O
Mol. Mass.:
442.3577
SMILES:
Cc1n[nH]c2OC(N)=C(C#N)C(C3CCC3)(c12)c1cc(cc(c1)C(F)(F)F)C(F)(F)F
: